signature not algorithm available

[Codeforces] CF1627B Not Sitting

题意 Rahul 和 Tina 在玩一个游戏。游戏在一个 \(n\times m\) 的网格图上进行,记第 \(r\) 行第 \(c\) 列上的格子为 \((r,c)\)。定义 \((a,b)\) 与 \((c,d)\) 之间的距离为 \(\left|a-c\right|+\left|b-d\rig ......
Codeforces Sitting 1627B 1627 Not

Error in nextTick: “TypeError: Right-hand side of ‘instanceof‘ is not callable“报错解决

很难发现的小错误,如果不经意间写错了 代码,很可能会对报错摸不着头脑: 其实就是参数的type值首字母没有大写,就会报上述错误 ......

conda环境下Python报错:raise MissingCUDAException("CUDA_HOME does not exist, unable to compile CUDA op(s)") CUDA_HOME does not exist, unable to compile CUDA op(s)

conda环境下Python报错: (pytorch) devil@Monster:~$ pip install deepspeed Collecting deepspeed Using cached deepspeed-0.12.4.tar.gz (1.2 MB) Preparing metada ......
CUDA CUDA_HOME compile unable exist

Python报错:pkg-config could not find libraries ['avformat', 'avcodec', 'avdevice', 'avutil', 'avfilter', 'swscale', 'swresample']

参考: https://github.com/PyAV-Org/PyAV/issues/238 https://pyav.org/docs/6.1.2/installation.html#mac-os-x 报错信息: C:\Users\liuxue>pip install av Collecting ......
39 pkg-config swresample libraries avformat

Java环境变量配置及报错java --version Error: could not open `D:\APP\Develop\JAVA\jre\lib\amd64\jvm.cfg'

C:\Users\Administrator>java --version Error: could not open `D:\APP\Develop\JAVA\jre\lib\amd64\jvm.cfg' Java环境变量的配置 控制面板→系统→高级系统设置→环境变量 在下方系统变量中新建 在下方 ......
变量 Develop version 环境 Error

Docker|--镜像中既有gcc和.NET运行时, 但是容器启动的时候报错 exec: "dotnet": executable file not found in $PATH: unknown.

基本信息 # 镜像gcc_for_net7_image是如何产生的, 分为3步 1.基于gcc的镜像运行起来的一个包含了gcc环境的容器, 2.在这个容器里安装了.NET7运行时, 3.再将这个包含了gcc环境和.NET7的容器打包为一个镜像"gcc_for_net7_image" 总之, 这个镜像 ......
quot 容器 executable 镜像 unknown

【解决】模拟器设置system读写报错'/dev/block/sda6' is read-only mount: '/system' not in /proc/mounts adb disable-verity failed to read fstab '/dev/root' is read-only

remount 失败 '/dev/block/sda6' is read-only adb disable-verity failed to read fstab '/dev/root' is read-only mount -o remount,rw /system mount: '/system ......
read-only 39 read system 模拟器

vue报错export 'default' (imported as 'VueRouter') was not found in 'vue-router'

直接使用npm install vue-router -save安装的路由,运行报错 经排查后发现是安装的vue-router版本太高 使用 npm uninstall vue-router 卸载之前安装的路由 使用 npm i vue-router@3.5.2 安装低版本的路由 问题解决!!! ......
39 vue-router vue VueRouter imported

Could not update Activiti database schema

原因:activiti 相关的jar版本和表 act_ge_property 中 schema.version 所存储的版本不一致导致报错的。 解决:查看activiti 相关jar版本,然后修改表中的版本就可以了 https://blog.csdn.net/qq_42277520/article/ ......
Activiti database update schema Could

Wireguard :`resolvconf: command not found`

问题描述 root@firewall:~# wg-quick up firewall [#] ip link add firewall type wireguard [#] wg setconf firewall /dev/fd/63 [#] ip -4 address add 10.0.1.2/2 ......
resolvconf Wireguard command found not

在eclipse中拖动项目到Tomcat服务器中报错:Project facet Java version 16 is not supported.解决办法

![](https://img2023.cnblogs.com/blog/3264156/202311/3264156-20231130200508727-1255579026.png) ![](https://img2023.cnblogs.com/blog/3264156/202311/3264... ......
中报 supported eclipse Project version

用matplot和seaborn作图,出现This application failed to start because not Qt platform plugin could be initialized的报错

用matplotlib和seaborn作图,出现这样的弹窗: 尝试过增加环境变量的方法没有解决。使用了一种临时的解决方法: import matplotlib matplotlib.use('TKAgg') 如果不需要图形化界面,只需要运行后的参数可以使用: import matplotlib ma ......

SpringBoot Resolved [org.springframework.web.multipart.support.MissingServletRequestPartException: Required request part 'file' is not present]

Resolved [org.springframework.web.multipart.support.MissingServletRequestPartException: Required request part 'file' is not present] ......

OpenWrt编译报错——configure: error: you should not run configure as root

OpenWrt编译报错——configure: error: you should not run configure as root 具体日志如下: checking whether mknod can create fifo without root privileges... configur ......
configure OpenWrt should error root

Git Pull/Push Error: Could not resolve proxy

Check to see if your environment has already gain the HTTP and HTTPS proxies: echo http_proxy echo https_proxy If they do exist in your environment, r ......
resolve Error Could proxy Pull

NOT IN 替换方式

1.第一条SQL not in 的写法,不推荐,(有坑) 如果not in 里面 SELECT B.RELEVANT_ID FROM T_COMPANY_DECIDE B where B.PROCESS_STATUS ='newly' and B.IS_DEL = '0' RELEVANT_ID 存 ......
方式 NOT IN

sqlstudio连接MySQL数据库报错public key is not allowed

jdbc:mysql://192.168.8.200:3306/company?serverTimezone=UTC&useUnicode=true&characterEncoding=utf-8&useSSL=false&allowPublicKeyRetrieval=true 在MySQL 5. ......
sqlstudio allowed 数据库 数据 public

【SpringBoot】单元测试报错java.lang.IllegalStateException: Could not load TestContextBootstrapper [null]

一、运行test类方法时候报错 二、分析原因,发现版本不一致 三、找到pom文件, 把<version>RELEASE</version>注释掉,刷新一下maven依赖 四:修改后,依赖版本一致。 这样,就可以运行了。 ......

Sql Server Not IN的坑

;with t as (select 1 id union all select 2 union all select 3 union all select null) select case when 5 in (select id from t) then 1 when 5 not in (se ......
Server Sql Not

论文:Predicting Optical Water Quality Indicators from Remote Sensing Using Machine Learning Algorithms in Tropical Highlands of Ethiopia

水刊,中科院都没有收录。不属于sci。 吃一堑长一智,以后先看属于哪个期刊的。总是忘记。 期刊:Hydrology 浪费时间,啥也没有,没有创新点,就一点点的对比工作量。 “Predicting Optical Water Quality Indicators from Remote Sensing ......

Zimp - Error message not equal

func TestDeleteAccount(t *testing.T) { account1 := createRandomAccount(t) err := testQueries.DeleteAccount(context.Background(), account1.ID) require. ......
message Error equal Zimp not

vue Vite3出现错误runtime-core.esm-bundler.js:6835 Uncaught TypeError: normalizeKey is not a function at createBaseVNode (runtime-core.esm-bundler.js:6835:19)

原因是在引入Element-Plus的顺序在vue之前导致,重新调整下他们的顺序后,问题解决。 import App from './App.vue' import { setupI18n } from '/@/i18n' import { setupRouter } from '/@/router ......

Mysql - Error 1055: Expression #1 of SELECT list is not in GROUP BY clause and contains nonaggregated column 'user.nickname' which is not functionally dependent on columns in GROUP BY clause

编写SQL时需要如下错误,即出现错误 ERROR 1055,SELECT列表不在GROUP BY语句内且存在不函数依赖GROUP BY语句的非聚合字段'edusassvc.u.nickname',这是和sql_mode=only_full_group_by不兼容的(即不支持)。 分析问题 1)原理层 ......

使用emqttd时执行emqttd console时无反应或者报错Node undefined not responding to pings.

1.无反应: 2.报错:Node undefined not responding to pings. 解决办法: 路径不能有空格,最好用存英文的路径。 ......
emqttd responding undefined console pings

java 打包后jmeter使用Invalid signature file digest for Manifest main attributes错误

ideal 编写代码后,打包了一个jar 是连关联的第三方jar一起打的 用到jmeter 后置处理器中 报错: Invalid signature file digest for Manifest main attributes 解决方案1:(手动删除文件) 通过压缩软件查看程序生成的jar包,可 ......
attributes signature Manifest 错误 Invalid

XML数字签名-Signature语法和签名算法[转]

XML数字签名-Signature语法和签名算法 一段Demo: <ds:Signature xmlns:ds="http://www.w3.org/2000/09/xmldsig#"> <ds:SignedInfo> <!-- 规范化的算法 --> <ds:CanonicalizationMeth ......
数字签名 算法 语法 Signature 数字

[WARNING] The POM for com.alibaba:druid:jar:1.1.21 is invalid, transitive dependencies (if any) will not be available, enable debug logging for more details是什么问题

这个警告表明 Maven 在尝试下载或处理 com.alibaba:druid:1.1.21 这个依赖项时遇到了问题。警告的具体内容是说 POM(Project Object Model)文件无效,这可能会导致 Maven 无法正确地处理传递性依赖关系。有几种可能的原因和解决方法: 1.网络问题: ......

SQLC - ERROR: relation "accounts" does not exist

Copied the example of sqlc.yaml generated by 'sqlc init' from https://docs.sqlc.dev/en/stable/tutorials/getting-started-postgresql.html# . Changed it ......
quot relation accounts ERROR exist

在idea中无法查看org.springframework.cglib.core.Signature.java 源码

一、现象 1.点击idea Download Source ,没有变化; Chouse Source 也无济于事。 2. 打开下载的源码包,惊奇的发现确实没有对应的源码。 3. 问题发生在哪儿? 原来是这些包原本不属于spring , spring 在编译的时候直接修改了包名称。 ......
springframework Signature 源码 cglib idea

mybatisPlus报orq.apache ibatisbinding.BindingException: Invalid bound statement (not found)错误

出现这种问题依次检查下列内容 1.检查xml映射文件中标签绑定包名地址是否正确(即namespace的值)2.检查xxxMapper接口中的方法,对应xml映射文件中是否有3.检查标签中的resultType是否与xxxMapper接口中的方法返回值类型一致,若一个是对象一个是集合,那也会报错~4. ......