module canberra-gtk-module canberra错误

解决AttributeError: module 'setuptools._distutils' has no attribute 'version'

setuptools 版本过高,需要降级,降为59.5.0版本比较合适: pip install setuptools==59.5.0 参考:解决AttributeError: module ‘setuptools._distutils‘ has no attribute ‘version‘_set ......

vscode调试import文件报错: ModuleNotFoundError No module named 'libs'

vscode调试python时出现import其他文件夹找不到路径的报错,需要设置正确的working directory (cwd)和PYTHONPATH(env) { "version": "0.2.0", "configurations": [ { "name": "Python: Curre ......

(转)SQL 抛出异常错误信息- RAISERROR (存储过程)

https://www.cnblogs.com/guorongtao/p/13896823.html SQL 抛出异常错误信息- RAISERROR (存储过程) 1、描述:生成错误消息并启动会话的错误处理。RAISERROR可以引用存储在系统消息目录视图或动态生成消息。该消息将作为服务器错误消息返 ......
RAISERROR 错误 过程 信息 SQL

Win11无法启动SqlServer服务问题,SqlServer服务启动1067错误

Win11无法启动SqlServer服务问题,SqlServer服务启动1067错误 因为SQL Server当前支持 512 字节和 4 KB 的扇区存储大小。所以需要将SqlServer安装到支持4KB的磁盘。 以管理员权限运行PowerShell,执行fsutil fsinfo sectori ......
SqlServer 错误 问题 1067 Win

dgl AttributeError: Can't get attribute 'DGLGraph' on <module 'dgl.heterograph' from '/home/user/anaconda3/envs/mymodel/lib/python3.7/site-packages/dgl/heterograph.py'>

由于服务器重装了系统,因此cuda版本和ubuntu系统版本也换了,不得不重装系统,导致以前可以正常运行的代码出了各种故障(注:现在的ubuntu版本是18.04,cuda版本是11.3) AttributeError: Can't get attribute 'DGLGraph' on <modu ......

CentOS httpd nginx WEB访问报503错误解决方案

外网访问WEB,需要关闭活着适当配置防火墙。centos7 防火墙状态查看、关闭、打开命令: firewall-cmd --state #防火墙状态查看 systemctl stop firewalld.service #防火墙关闭 systemctl start firewalld.service ......
解决方案 错误 方案 CentOS httpd

记录rabbitMQ的广播队列的错误使用导致未能正确广播的问题

背景说明: 有3个服务S1、S2、S3 现在服务S1需要发布消息到广播交换机E,并建立了两个普通队列Q1,Q2,将其绑定到广播交换机E上 服务S2和服务S3同时监听队列Q1,Q2 本意是,服务S1通过广播交换机E把消息同时推送给服务S2和S3 后面测试时,同事发现,服务S2和服务S3都只接收到了部分 ......
队列 rabbitMQ 错误 问题

在升级到 .NET 8 后连接数据库时遇到错误:SSL 提供程序:证书链由不受信任的颁发机构颁发。

快速的解决方法就是在连接字符串最后添加以下配置参数,强制信任来自服务器的证书: ;TrustServerCertificate=true 可能正经解决应该是为数据库服务添加证书? 参考:https://learn.microsoft.com/zh-cn/troubleshoot/sql/databa ......
证书 错误 机构 数据库 程序

MySQL:SQL 错误 [1118] [42000]: Row size too large.

1.场景: 今天在用MySQL建表的时候,报了一个错误; SQL 错误 [1118] [42000]: Row size too large. The maximum row size for the used table type, not counting BLOBs, is 65535. Th ......
错误 MySQL 42000 large 1118

Django中常遇到的错误

这条是我今晚遇到的错误,下面的是借鉴别的大佬的经验的。今晚遇到的错误是You're seeing this error because you have DEBUG = True in your Django settin于是我就把setting配置文件中的DEBUG 改成了False 但是在我改完 ......
错误 Django

API 设计错误

缺乏一致性: API 设计中的一个常见错误是缺乏连贯的结构。命名约定、数据格式和错误处理方面的不一致可能会导致尝试集成 API 的开发人员感到困惑。要解决此问题,请为命名、格式设置和响应错误建立清晰且一致的准则。一致性不仅简化了使用,还改善了整体用户体验。 文档不充分: 文档不充分或过时是一个问题。 ......
错误 API

rror: Cannot find module ‘webpack‘ 问题解决办法

项目场景:新项目本地运行报错 问题描述本地拉去项目后,安装项目对应的包,执行 npm run dev ,报错 报错信息如下: Error: Cannot find module 'webpack' at Function.Module._resolveFilename (module.js:469: ......
webpack 办法 Cannot module 问题

ASP.NET Core 3.1出现HTTP Error 500.30 - ANCM In-Process Start Failure 日志错误'0xe0434352'

升级Visual Studio后无法运行ASP.NET Core 3.1出现HTTP Error 500.30 - ANCM In-Process Start Failure 日志错误'0xe0434352', 高版本NET正常运行. ......
In-Process 错误 0434352 Failure Process

ModuleNotFoundError: No module named 'kornia'

这个错误通常表示你的环境中没有安装名为 "kornia" 的 Python 模块。Kornia 是一个用于计算机视觉任务的开源库,你可能需要先安装它才能使用相关功能。 你可以使用以下命令使用 pip 安装 kornia: pip install kornia 如果你使用的是 Conda 环境,可以尝 ......
ModuleNotFoundError module kornia named 39

基于 Webpack5 Module Federation 的业务解耦实践

我们是袋鼠云数栈 UED 团队,致力于打造优秀的一站式数据中台产品。我们始终保持工匠精神,探索前端道路,为社区积累并传播经验价值。 本文作者:贝儿 前言 本文中会提到很多目前数栈中使用的特定名词,统一做下解释描述 dt-common:每个子产品都会引入的公共包(类似 NPM 包) AppMenus: ......
解耦 Federation Webpack5 Webpack 业务

PHP 异常与错误 —— Throwable

Throwable 官方文档地址: http://php.net/manual/en/class.throwable.php PHP 支持版本: 7 Throwable 是 PHP 7 中可以用作任何对象抛出声明的基本接口,包括 Expection (异常)和 Error (错误)。 Throwab ......
Throwable 错误 PHP

ModuleNotFoundError: No module named 'pip'

今天打开在anaconda和pycharm中切换后发现原来本地的python的pip报错了,ModuleNotFoundError: No module named 'pip' 后来在网上找到解决办法,首先以管理员身份打开cmd,然后找到自己经常使用的pip路径,输入以下命令 curl https: ......
ModuleNotFoundError module named 39 pip

MySQL中的slave_exec_mode 参数详解(MySQL从节点复制错误处理时,sql_slave_skip_counter VS slave-skip-errors VS slave_exec_mode)(译)

原文地址:https://www.soughttech.com/front/article/7159/viewArticle 今天我偶然看到了参数slave_exec_mode。从手册中的描述可以看出,该参数与MySQL复制有关。它是一个可以动态修改的变量。默认为STRICT mode(严格模式), ......

k8s错误集合

1、etcd没有启动的 [root@mcwk8s03 ~]# kubectl get nodesUnable to connect to the server: context deadline exceeded 启动之后就可以使用了 [root@mcwk8s03 ~]# kubectl get n ......
错误 k8s k8 8s

selenium运行时的ValueError: Timeout value connect was <object object at 0x000001FE483C4170>......错误

from selenium import webdriver driver = webdriver.Chrome() driver.get("https://www.baidu.com/") 运行时出现ValueError: Timeout value connect was <object obj ......
object ValueError selenium 错误 Timeout

IDEA+SSM踩坑:org.apache.ibatis.binding.BindingException: Invalid bound statement (not found)错误

在学习SSM框架时遇到了这个异常: org.apache.ibatis.binding.BindingException: Invalid bound statement (not found) 通过网上搜索原因时因为Mapper interface和xml文件的定义对应不上导致的。 按照搜索的解决 ......

docker问题 dubbo-admin浏览器错误

问题描述: zookeeper容器配置成功,dubbo-admin容器配置成功。 使用docker ps显示两个容器都启动成功且映射端口没有出错。 在虚拟机中ping本机和在本机中ping虚拟机都显示正常接通。 使用浏览器访问dubbo-admin时浏览器无法显示。 解决方案: 修改docker配置 ......
dubbo-admin 浏览器 错误 docker 问题

Qt错误排查

1、error LNK2001: 无法解析的外部符号 "public: virtual struct QMetaObject 在添加Q_OBJECT后出现的错误提示。 解决:这个宏放在头文件中,而不是cpp中。 原因:QT error LNK2001: 无法解析的外部符号 "public: virt ......
错误

关于Android接入高德地图定位 错误码 20,然后提示你模糊权限下无法定位

原因 使用了 ACCESS_COARSE_LOCATION权限,未使用 ACCESS_FINE_LOCATION 权限 而 ACCESS_FINE_LOCATION 权限是提供高精度的定位,ACCESS_COARSE_LOCATION 只能提供模糊的权限,在动态申请权限时 需要去申请ACCESS_F ......
权限 错误 Android 地图

【AGC】API8元服务上架传包错误码5的问题

​【问题背景】 近期收到了一些反馈,一些鸿蒙元服务开发者在发布应用市场的过程中,上传.app包时遇到了错误码 5的报错,导致上传失败,下面来看一下这些报错的具体原因。 ​ 【解决方案】 在获取到appid后,查询失败日志,失败原因显示:* 元服务默认卡片校验失败DEFAULT_DIMENSION_C ......
错误 问题 API8 AGC API

Linux学习35- python3.9出现ModuleNotFoundError: No module named '_ctypes'的解决

遇到问题 pip 安装第三方库的时候报错ModuleNotFoundError: No module named '_ctypes' File "/usr/local/python3/lib/python3.9/ctypes/__init__.py", line 7, in <module> fro ......

1804:错误探测

原题 这道题虽然一次ac了,而且写的很顺,没调就过了,所以记录一下想法撒 #include<bits/stdc++.h> using namespace std; int main() { int s[101][101] = {}; int x[101],y[101]; int n,flag = 0 ......
错误 1804

宝塔面板申请ssl证书验证失败,域名解析错误或验证URL无法被访

一、问题描述 使用宝塔面板建立站点,申请let‘s Encrypt 免费ssl证书时提示验证失败,域名解析错误或验证URL无法被访! 网上找了各种方案 检查防火墙配置,安全组配置,域名解析,nginx代理等等乱七八糟的配置 检查来检查去发现都没问题,后来我注意到,这个错误提示是去访问本站点内的一个文 ......
宝塔 面板 证书 错误 域名

总线出现错误帧或负载帧

on errorFrame { const int bufferSize = 256; //bufferSize不可以再被赋值 char buffer[bufferSize]; char cdirection[2][3] = {"RX","TX"}; int ndir; word ecc; word ......
总线 错误

C#错误--02,5): error MSB3021: 无法将文件“obj\Debug\TheLastC.exe”复制到“bin\Debug\TheLastC.exe”。文件“bin\Debug\TheLastC.exe”正由另一进程使用,因此该进程无法访问此文件。

问题描述 使用任务管理器停止进程也没有作用; 问题解决 进入到该项目的bin目录下的debug目录,将里面的exe文件删除,就能够重新运行啦; (若是提示正在使用该exe文件,那么可以使用火绒软件来解除占用--亲测好用极了--之后就能够正常删除掉exe文件,从而使得程序正常运行); ......
TheLastC 文件 Debug 进程 exe
共1900篇  :6/64页 首页上一页6下一页尾页